{"text_format":"3","workbook":"xlsx","n_sheets":8,"sheets":["σ","c1","φ","List","formulas","Корпус","Штуцери","Розрахунок"],"not_rendered":{"images":6,"defined_names":7},"read":"whole","date_system":"1900"}

{"sheet":"σ","index":0,"n_rows":44,"n_cols":7,"rows_kept":44}
["Сталь","Розрахункова температура стінки посудини, оС ","Індекс пошуку","Допустиме напруження, МПа (σ)"]
["20, 20К",20,{"$f":"CONCATENATE(A2,B2)","v":"20, 20К20"},147]
["20, 20К",30,{"$f":"CONCATENATE(A3,B3)","v":"20, 20К30"},146.375]
["20, 20К",40,"20, 20К40",145.75]
["20, 20К",50,"20, 20К50",145.125,null,null,"При внесенні нових даних, необхідно дотримуватися кроку розрахункової температури в 10 оС"]
["20, 20К",60,"20, 20К60",144.5]
["20, 20К",70,"20, 20К70",143.875]
["20, 20К",80,"20, 20К80",143.25]
["20, 20К",90,"20, 20К90",142.625]
["20, 20К",100,"20, 20К100",142]
["20, 20К",110,"20, 20К110",141.4]
["20, 20К",120,"20, 20К120",140.8]
["20, 20К",130,"20, 20К130",140.20000000000002]
["20, 20К",140,"20, 20К140",139.60000000000002]
["20, 20К",150,"20, 20К150",139]
["20, 20К",160,"20, 20К160",138.4]
["20, 20К",170,"20, 20К170",137.8]
["20, 20К",180,"20, 20К180",137.20000000000002]
["20, 20К",190,"20, 20К190",136.60000000000002]
["20, 20К",200,"20, 20К200",136]
{"$rows_left_out":25}
{"sheet":"c1","index":1,"n_rows":7,"n_cols":5,"rows_kept":7,"merged":[[0,1,0,4]]}
[null,"Прибавка на компенсацію корозії (ерозії) відповідно до РД 10-249-98\n"]
[null,"Середовище","Труби діаметром до 32 мм","Труби (обичайки) діаметром від 32 до 76 мм включно","більше 76 мм"]
[null,"вода",0,0.5,1]
[null,"насичена водяна пара",0,0.5,1]
[null,"перегріта водяна пара",0,0.3,0.5]
[null,"водяна пара надкритичних параметрів",0,0,0.3]
[null,"суміш води та водяної пари",0,0.5,1]

{"sheet":"φ","index":2,"n_rows":7,"n_cols":4,"rows_kept":7}
[null,"Вид зварного з'єднання",{"v":1,"d":"100%"},{"v":0.5,"d":"50%"}]
[null,"Стиковий з двохстороннім проваром",1,0.9]
[null,"Стиковий односторонній",0.9,0.8]
[null,"Стиковий односторонній (ручне зварювання)",0.9,0.65]
[]
[]
[null," ГОСТ 14249-89"]

{"sheet":"List","index":3,"n_rows":18,"n_cols":10,"rows_kept":18,"hidden":true}
["Сталь",null,"Середовище",null,"DN",null,"Елемент корпусу",null,"Розташування штуцера"]
["ВСт3",null,"вода",null,10,null,"обичайка",null,"1 - Вісь штуцера співпадає з нормаллю до поверхні в центрі отвору",1]
["09Г2С",null,"насичена водяна пара",null,15,null,"днище 1",null,"2 - Вісь штуцера лежить у площині поперечного перерізу обичайки",2]
["16ГС",null,"перегріта водяна пара",null,20,null,"днище 2",null,"3 - Зміщенний штуцер на днищі",3]
["20, 20К",null,"водяна пара надкритичних параметрів",null,25]
[10,null,"суміш води та водяної пари",null,32]
["10Г2, 09Г2",{"$nulls":3},40]
["17ГС, 17Г1С, 10Г2С1",{"$nulls":3},50]
["12ХМ",{"$nulls":3},65]
["12МХ",{"$nulls":3},80]
["15ХМ",{"$nulls":3},90]
["15Х5М",{"$nulls":3},100]
["15Х5М-У",{"$nulls":3},125]
["03Х21Н21М4ГБ",{"$nulls":3},150]
["03Х18Н11",{"$nulls":3},160]
["03X17H14M3",{"$nulls":3},200]
["08Х18Н10Т, 08Х18Н12Т, 08Х17Н13М2Т, 08Х17Н15МЗТ",{"$nulls":3},225]
["12Х18Н10Т, 12Х18Н12Т, 10Х17Н13М2Т, 10X17H13M3T",{"$nulls":3},250]

{"sheet":"formulas","index":4,"n_rows":16,"n_cols":4,"rows_kept":16,"hidden":true}
[null,"Найменування","Одиниця виміру","Значення"]
[null,"Обичайка"]
[null,"Умова застосування розрахункових формул","-",{"$f":"ROUND((Корпус!C16-Розрахунок!I78)/Розрахунок!I61,2)","v":{"$error":"#N/A"}}]
[null,"Товщина стінки обичайки розрахункова","мм",{"$f":"ROUND((Розрахунок!I64*Розрахунок!I61/(20*Розрахунок!I69*Розрахунок!I71-Розрахунок!I64/10)),2)","v":{"$error":"#N/A"}}]
[null,"Коефіцієнт запасу міцності","-",{"$f":"ROUND(Корпус!C16/(Розрахунок!I64*Розрахунок!I61/(20*Розрахунок!I69*Розрахунок!I71-Розрахунок!I64/10)+Розрахунок!I78),2)","v":{"$error":"#N/A"}}]
[null,"Допустимий внутрішній надлишковий тиск","бар",{"$f":"ROUND(20*Розрахунок!I69*Розрахунок!I71*(Корпус!C16-Розрахунок!I78)/(Розрахунок!I61+Корпус!C16-Розрахунок!I78),2)","v":{"$error":"#N/A"}}]
[]
[null,"Днище"]
[null,"Умова застосування розрахункових формул","-",{"$f":"ROUND((Корпус!C20-Розрахунок!I84)/Розрахунок!I61,2)","v":{"$error":"#N/A"}}]
[null,"Товщина стінки днища розрахункова","мм",{"$f":"ROUND(Розрахунок!I64*Розрахунок!I62/(20*Розрахунок!I70*Розрахунок!I71-0.5*Розрахунок!I64/10),2)","v":{"$error":"#N/A"}}]
[null,"Коефіцієнт запасу міцності","-",{"$f":"ROUND(Корпус!C20/(Розрахунок!I64*Розрахунок!I62/(20*Розрахунок!I70*Розрахунок!I71-Розрахунок!I64/10)+Розрахунок!I84),2)","v":{"$error":"#N/A"}}]
[null,"Допустимий внутрішній надлишковий тиск","бар",{"$f":"ROUND(20*(Корпус!C20-Розрахунок!I84)*Розрахунок!I71*Розрахунок!I70/(Розрахунок!I62+0.5*(Корпус!C20-Розрахунок!I84)),2)","v":{"$error":"#N/A"}}]
[]
[null,"Розрахункові діаметри"]
[null,"Циліндричної обичайки","мм",{"$f":"Корпус!C15-2*Корпус!C16","v":0}]
[null,"Еліптичного днища (Н=0,25D)","мм",{"$f":"2*(Корпус!C19-2*Корпус!C20)","v":0}]

{"sheet":"Корпус","index":5,"n_rows":36,"n_cols":11,"rows_kept":36,"merged":[[10,10,12,19]]}
[null,"Характеристика",null,"Примітка/Пояснення"]
[null,"Загальні"]
[null,"Найменування обладнання"]
[null,"Скорочене найменування обладнання ",null,"для вставки в тект розрахунку"]
[null,"Місто"]
[null,"Рік розрахунку"]
[]
[null,"Фізичні"]
[null,"Розрахункова температура (t), оС",null,"Найбільше значення температури стінки в процесі роботи обладнання"]
[null,"Робочий тиск (Рроб) , бар",null,"Максимальний внутрішній надлишковий тиск, який виникає при нормальному протіканні процесу"]
[null,"Розрахунковий тиск, бар (p)",null,"Проводиться розрахунок на міцність. Більший або рівний робочому. Як правило, можна приймати на 1 бар більшим за робочий, якщо інше не обгрунтовано досвідом експлуатації",{"$nulls":6},"Розрахунок виконується лише у разі застосування еліптичного днища та гладкої циліндричної обичайки. У іншому випадку необхідно або виконати розрахунок самостійно, або за допомогою інших програм чи методів, або внести відповідні зміни в даний файл (31.01.2020)"]
[null,"Середовище",null,"Вибір із випадаючого списку"]
[]
[null,"Конструктивні"]
[null,"Зовнішній діаметр обичайки (Dз), мм"]
[null,"Товщина стінки обичайки (s), мм"]
[null,"Матеріал обичайки",null,"Вибір із випадаючого списку"]
[]
[null,"Зовнішній діаметр днища (Dз), мм"]
[null,"Товщина стінки днища (s), мм"]
{"$rows_left_out":17}
{"sheet":"Штуцери","index":6,"n_rows":31,"n_cols":24,"rows_kept":31,"merged":[[0,6,0,8]]}
[{"$nulls":6},"Прибавки до товщини стінки"]
["№\nштуцера","Умовний діаметр DN, мм","Зовнішній діаметр, мм","Товщина стінки, мм","Метал штуцера","Середовище","Прибавка для компенсації корозії (ерозії) с1, мм","Прибавка для компенсації мінусового допуску с2, мм","Прибавка для компенсації утоншення стінки при технологічних операціях с3, мм","Елемент корпусу","Коефіцієнт міцності зварного шва","Розташування штуцера","Зміщення штуцера відносно осі обичайки/днища х, мм","Довжина отвору в окружному напрямі (див. А.11 б,г), t\nВизначається за кресленнями",null,"Для розрахунків","Внутрішній діаметр, мм","Розрахунковий діаметр, мм","Внутрішній діаметр елемента (обичайка/днище)","Загальна прибавка до товщини стінки елемента (обичайка/днище) с, мм","Товщина стінки елемента (обичайка/днище), мм",{"$f":"Розрахунок!I134","v":"Умови застосування розрахункових вормул"},"Додатковий","Допустиме напруження сталі штуцера, Мпа"]
[1,{"$nulls":5},{"$f":"IF(C3<32,0,IF(C3>76,VLOOKUP(F3,'c1'!B:E,4,FALSE),VLOOKUP(F3,'c1'!B:E,3,FALSE)))","v":0},{"$f":"15%*D3","v":0},{"$nulls":7},{"$f":"IFERROR(VLOOKUP(L3,List!I:J,2,FALSE),0)","v":0},{"$f":"C3-2*D3","v":0},{"$f":"IF(P3=3,(Q3+2*(G3+H3+I3))/SQRT(1-4*M3*M3/((Корпус!$C$19-2*Корпус!$C$20)*(Корпус!$C$19-2*Корпус!$C$20))),MAX(Штуцери!Q3,0.5*Штуцери!N3)+2*(Штуцери!G3+Штуцери!H3+Штуцери!I3))","v":0},{"$f":"IF(J3=\"\",0,IF(J3=List!$G$2,Корпус!$C$15-2*Корпус!$C$16,Корпус!$C$19-2*Корпус!$C$20))","v":0},{"$f":"IF(J3=Розрахунок!$A$74,Розрахунок!$I$78,IF(J3=Розрахунок!$A$80,Розрахунок!$I$84,0))","v":0},{"$f":"IF(J3=Розрахунок!$A$74,Корпус!$C$16,IF(J3=Розрахунок!$A$80,Корпус!$C$20,0))","v":0},{"$f":"Розрахунок!I135","v":""},{"$f":"IF(OR(V3=\"Виконується\",V3=\"\"),1,0)","v":1},{"$f":"IFERROR(VLOOKUP(CONCATENATE(E3,10*ROUND(Корпус!$C$9/10,0)),σ!C:D,2,FALSE),0)","v":0}]
[2,{"$nulls":5},{"$f":"IF(C4<32,0,IF(C4>76,VLOOKUP(F4,'c1'!B:E,4,FALSE),VLOOKUP(F4,'c1'!B:E,3,FALSE)))","v":0},{"$f":"15%*D4","v":0},{"$nulls":7},{"$f":"IFERROR(VLOOKUP(L4,List!I:J,2,FALSE),0)","v":0},{"$f":"C4-2*D4","v":0},{"$f":"IF(P4=3,(Q4+2*(G4+H4+I4))/SQRT(1-4*M4*M4/((Корпус!$C$19-2*Корпус!$C$20)*(Корпус!$C$19-2*Корпус!$C$20))),MAX(Штуцери!Q4,0.5*Штуцери!N4)+2*(Штуцери!G4+Штуцери!H4+Штуцери!I4))","v":0},{"$f":"IF(J4=\"\",0,IF(J4=List!$G$2,Корпус!$C$15-2*Корпус!$C$16,Корпус!$C$19-2*Корпус!$C$20))","v":0},{"$f":"IF(J4=Розрахунок!$A$74,Розрахунок!$I$78,IF(J4=Розрахунок!$A$80,Розрахунок!$I$84,0))","v":0},{"$f":"IF(J4=Розрахунок!$A$74,Корпус!$C$16,IF(J4=Розрахунок!$A$80,Корпус!$C$20,0))","v":0},{"$f":"Розрахунок!I136","v":""},{"$f":"IF(OR(V4=\"Виконується\",V4=\"\"),1,0)","v":1},{"$f":"IFERROR(VLOOKUP(CONCATENATE(E4,10*ROUND(Корпус!$C$9/10,0)),σ!C:D,2,FALSE),0)","v":0}]
[3,{"$nulls":5},{"$f":"IF(C5<32,0,IF(C5>76,VLOOKUP(F5,'c1'!B:E,4,FALSE),VLOOKUP(F5,'c1'!B:E,3,FALSE)))","v":0},0,{"$nulls":7},{"$f":"IFERROR(VLOOKUP(L5,List!I:J,2,FALSE),0)","v":0},0,{"$f":"IF(P5=3,(Q5+2*(G5+H5+I5))/SQRT(1-4*M5*M5/((Корпус!$C$19-2*Корпус!$C$20)*(Корпус!$C$19-2*Корпус!$C$20))),MAX(Штуцери!Q5,0.5*Штуцери!N5)+2*(Штуцери!G5+Штуцери!H5+Штуцери!I5))","v":0},{"$f":"IF(J5=\"\",0,IF(J5=List!$G$2,Корпус!$C$15-2*Корпус!$C$16,Корпус!$C$19-2*Корпус!$C$20))","v":0},{"$f":"IF(J5=Розрахунок!$A$74,Розрахунок!$I$78,IF(J5=Розрахунок!$A$80,Розрахунок!$I$84,0))","v":0},{"$f":"IF(J5=Розрахунок!$A$74,Корпус!$C$16,IF(J5=Розрахунок!$A$80,Корпус!$C$20,0))","v":0},{"$f":"Розрахунок!I137","v":""},1,{"$f":"IFERROR(VLOOKUP(CONCATENATE(E5,10*ROUND(Корпус!$C$9/10,0)),σ!C:D,2,FALSE),0)","v":0}]
[4,{"$nulls":5},{"$f":"IF(C6<32,0,IF(C6>76,VLOOKUP(F6,'c1'!B:E,4,FALSE),VLOOKUP(F6,'c1'!B:E,3,FALSE)))","v":0},0,{"$nulls":7},{"$f":"IFERROR(VLOOKUP(L6,List!I:J,2,FALSE),0)","v":0},0,{"$f":"IF(P6=3,(Q6+2*(G6+H6+I6))/SQRT(1-4*M6*M6/((Корпус!$C$19-2*Корпус!$C$20)*(Корпус!$C$19-2*Корпус!$C$20))),MAX(Штуцери!Q6,0.5*Штуцери!N6)+2*(Штуцери!G6+Штуцери!H6+Штуцери!I6))","v":0},{"$f":"IF(J6=\"\",0,IF(J6=List!$G$2,Корпус!$C$15-2*Корпус!$C$16,Корпус!$C$19-2*Корпус!$C$20))","v":0},{"$f":"IF(J6=Розрахунок!$A$74,Розрахунок!$I$78,IF(J6=Розрахунок!$A$80,Розрахунок!$I$84,0))","v":0},{"$f":"IF(J6=Розрахунок!$A$74,Корпус!$C$16,IF(J6=Розрахунок!$A$80,Корпус!$C$20,0))","v":0},{"$f":"Розрахунок!I138","v":""},1,{"$f":"IFERROR(VLOOKUP(CONCATENATE(E6,10*ROUND(Корпус!$C$9/10,0)),σ!C:D,2,FALSE),0)","v":0}]
[5,{"$nulls":5},{"$f":"IF(C7<32,0,IF(C7>76,VLOOKUP(F7,'c1'!B:E,4,FALSE),VLOOKUP(F7,'c1'!B:E,3,FALSE)))","v":0},0,{"$nulls":7},{"$f":"IFERROR(VLOOKUP(L7,List!I:J,2,FALSE),0)","v":0},0,{"$f":"IF(P7=3,(Q7+2*(G7+H7+I7))/SQRT(1-4*M7*M7/((Корпус!$C$19-2*Корпус!$C$20)*(Корпус!$C$19-2*Корпус!$C$20))),MAX(Штуцери!Q7,0.5*Штуцери!N7)+2*(Штуцери!G7+Штуцери!H7+Штуцери!I7))","v":0},{"$f":"IF(J7=\"\",0,IF(J7=List!$G$2,Корпус!$C$15-2*Корпус!$C$16,Корпус!$C$19-2*Корпус!$C$20))","v":0},{"$f":"IF(J7=Розрахунок!$A$74,Розрахунок!$I$78,IF(J7=Розрахунок!$A$80,Розрахунок!$I$84,0))","v":0},{"$f":"IF(J7=Розрахунок!$A$74,Корпус!$C$16,IF(J7=Розрахунок!$A$80,Корпус!$C$20,0))","v":0},{"$f":"Розрахунок!I139","v":""},1,{"$f":"IFERROR(VLOOKUP(CONCATENATE(E7,10*ROUND(Корпус!$C$9/10,0)),σ!C:D,2,FALSE),0)","v":0}]
[6,{"$nulls":5},{"$f":"IF(C8<32,0,IF(C8>76,VLOOKUP(F8,'c1'!B:E,4,FALSE),VLOOKUP(F8,'c1'!B:E,3,FALSE)))","v":0},0,{"$nulls":7},{"$f":"IFERROR(VLOOKUP(L8,List!I:J,2,FALSE),0)","v":0},0,{"$f":"IF(P8=3,(Q8+2*(G8+H8+I8))/SQRT(1-4*M8*M8/((Корпус!$C$19-2*Корпус!$C$20)*(Корпус!$C$19-2*Корпус!$C$20))),MAX(Штуцери!Q8,0.5*Штуцери!N8)+2*(Штуцери!G8+Штуцери!H8+Штуцери!I8))","v":0},{"$f":"IF(J8=\"\",0,IF(J8=List!$G$2,Корпус!$C$15-2*Корпус!$C$16,Корпус!$C$19-2*Корпус!$C$20))","v":0},{"$f":"IF(J8=Розрахунок!$A$74,Розрахунок!$I$78,IF(J8=Розрахунок!$A$80,Розрахунок!$I$84,0))","v":0},{"$f":"IF(J8=Розрахунок!$A$74,Корпус!$C$16,IF(J8=Розрахунок!$A$80,Корпус!$C$20,0))","v":0},{"$f":"Розрахунок!I140","v":""},1,{"$f":"IFERROR(VLOOKUP(CONCATENATE(E8,10*ROUND(Корпус!$C$9/10,0)),σ!C:D,2,FALSE),0)","v":0}]
[7,{"$nulls":5},{"$f":"IF(C9<32,0,IF(C9>76,VLOOKUP(F9,'c1'!B:E,4,FALSE),VLOOKUP(F9,'c1'!B:E,3,FALSE)))","v":0},0,{"$nulls":7},{"$f":"IFERROR(VLOOKUP(L9,List!I:J,2,FALSE),0)","v":0},0,{"$f":"IF(P9=3,(Q9+2*(G9+H9+I9))/SQRT(1-4*M9*M9/((Корпус!$C$19-2*Корпус!$C$20)*(Корпус!$C$19-2*Корпус!$C$20))),MAX(Штуцери!Q9,0.5*Штуцери!N9)+2*(Штуцери!G9+Штуцери!H9+Штуцери!I9))","v":0},{"$f":"IF(J9=\"\",0,IF(J9=List!$G$2,Корпус!$C$15-2*Корпус!$C$16,Корпус!$C$19-2*Корпус!$C$20))","v":0},{"$f":"IF(J9=Розрахунок!$A$74,Розрахунок!$I$78,IF(J9=Розрахунок!$A$80,Розрахунок!$I$84,0))","v":0},{"$f":"IF(J9=Розрахунок!$A$74,Корпус!$C$16,IF(J9=Розрахунок!$A$80,Корпус!$C$20,0))","v":0},{"$f":"Розрахунок!I141","v":""},1,{"$f":"IFERROR(VLOOKUP(CONCATENATE(E9,10*ROUND(Корпус!$C$9/10,0)),σ!C:D,2,FALSE),0)","v":0}]
[8,{"$nulls":5},{"$f":"IF(C10<32,0,IF(C10>76,VLOOKUP(F10,'c1'!B:E,4,FALSE),VLOOKUP(F10,'c1'!B:E,3,FALSE)))","v":0},0,{"$nulls":7},{"$f":"IFERROR(VLOOKUP(L10,List!I:J,2,FALSE),0)","v":0},0,{"$f":"IF(P10=3,(Q10+2*(G10+H10+I10))/SQRT(1-4*M10*M10/((Корпус!$C$19-2*Корпус!$C$20)*(Корпус!$C$19-2*Корпус!$C$20))),MAX(Штуцери!Q10,0.5*Штуцери!N10)+2*(Штуцери!G10+Штуцери!H10+Штуцери!I10))","v":0},{"$f":"IF(J10=\"\",0,IF(J10=List!$G$2,Корпус!$C$15-2*Корпус!$C$16,Корпус!$C$19-2*Корпус!$C$20))","v":0},{"$f":"IF(J10=Розрахунок!$A$74,Розрахунок!$I$78,IF(J10=Розрахунок!$A$80,Розрахунок!$I$84,0))","v":0},{"$f":"IF(J10=Розрахунок!$A$74,Корпус!$C$16,IF(J10=Розрахунок!$A$80,Корпус!$C$20,0))","v":0},{"$f":"Розрахунок!I142","v":""},1,{"$f":"IFERROR(VLOOKUP(CONCATENATE(E10,10*ROUND(Корпус!$C$9/10,0)),σ!C:D,2,FALSE),0)","v":0}]
[9,{"$nulls":5},{"$f":"IF(C11<32,0,IF(C11>76,VLOOKUP(F11,'c1'!B:E,4,FALSE),VLOOKUP(F11,'c1'!B:E,3,FALSE)))","v":0},0,{"$nulls":7},{"$f":"IFERROR(VLOOKUP(L11,List!I:J,2,FALSE),0)","v":0},0,{"$f":"IF(P11=3,(Q11+2*(G11+H11+I11))/SQRT(1-4*M11*M11/((Корпус!$C$19-2*Корпус!$C$20)*(Корпус!$C$19-2*Корпус!$C$20))),MAX(Штуцери!Q11,0.5*Штуцери!N11)+2*(Штуцери!G11+Штуцери!H11+Штуцери!I11))","v":0},{"$f":"IF(J11=\"\",0,IF(J11=List!$G$2,Корпус!$C$15-2*Корпус!$C$16,Корпус!$C$19-2*Корпус!$C$20))","v":0},{"$f":"IF(J11=Розрахунок!$A$74,Розрахунок!$I$78,IF(J11=Розрахунок!$A$80,Розрахунок!$I$84,0))","v":0},{"$f":"IF(J11=Розрахунок!$A$74,Корпус!$C$16,IF(J11=Розрахунок!$A$80,Корпус!$C$20,0))","v":0},{"$f":"Розрахунок!I143","v":""},1,{"$f":"IFERROR(VLOOKUP(CONCATENATE(E11,10*ROUND(Корпус!$C$9/10,0)),σ!C:D,2,FALSE),0)","v":0}]
[10,{"$nulls":5},{"$f":"IF(C12<32,0,IF(C12>76,VLOOKUP(F12,'c1'!B:E,4,FALSE),VLOOKUP(F12,'c1'!B:E,3,FALSE)))","v":0},0,{"$nulls":7},{"$f":"IFERROR(VLOOKUP(L12,List!I:J,2,FALSE),0)","v":0},0,{"$f":"IF(P12=3,(Q12+2*(G12+H12+I12))/SQRT(1-4*M12*M12/((Корпус!$C$19-2*Корпус!$C$20)*(Корпус!$C$19-2*Корпус!$C$20))),MAX(Штуцери!Q12,0.5*Штуцери!N12)+2*(Штуцери!G12+Штуцери!H12+Штуцери!I12))","v":0},{"$f":"IF(J12=\"\",0,IF(J12=List!$G$2,Корпус!$C$15-2*Корпус!$C$16,Корпус!$C$19-2*Корпус!$C$20))","v":0},{"$f":"IF(J12=Розрахунок!$A$74,Розрахунок!$I$78,IF(J12=Розрахунок!$A$80,Розрахунок!$I$84,0))","v":0},{"$f":"IF(J12=Розрахунок!$A$74,Корпус!$C$16,IF(J12=Розрахунок!$A$80,Корпус!$C$20,0))","v":0},{"$f":"Розрахунок!I144","v":""},1,{"$f":"IFERROR(VLOOKUP(CONCATENATE(E12,10*ROUND(Корпус!$C$9/10,0)),σ!C:D,2,FALSE),0)","v":0}]
[11,{"$nulls":5},{"$f":"IF(C13<32,0,IF(C13>76,VLOOKUP(F13,'c1'!B:E,4,FALSE),VLOOKUP(F13,'c1'!B:E,3,FALSE)))","v":0},0,{"$nulls":7},{"$f":"IFERROR(VLOOKUP(L13,List!I:J,2,FALSE),0)","v":0},0,{"$f":"IF(P13=3,(Q13+2*(G13+H13+I13))/SQRT(1-4*M13*M13/((Корпус!$C$19-2*Корпус!$C$20)*(Корпус!$C$19-2*Корпус!$C$20))),MAX(Штуцери!Q13,0.5*Штуцери!N13)+2*(Штуцери!G13+Штуцери!H13+Штуцери!I13))","v":0},{"$f":"IF(J13=\"\",0,IF(J13=List!$G$2,Корпус!$C$15-2*Корпус!$C$16,Корпус!$C$19-2*Корпус!$C$20))","v":0},{"$f":"IF(J13=Розрахунок!$A$74,Розрахунок!$I$78,IF(J13=Розрахунок!$A$80,Розрахунок!$I$84,0))","v":0},{"$f":"IF(J13=Розрахунок!$A$74,Корпус!$C$16,IF(J13=Розрахунок!$A$80,Корпус!$C$20,0))","v":0},{"$f":"Розрахунок!I145","v":""},1,{"$f":"IFERROR(VLOOKUP(CONCATENATE(E13,10*ROUND(Корпус!$C$9/10,0)),σ!C:D,2,FALSE),0)","v":0}]
[12,{"$nulls":5},{"$f":"IF(C14<32,0,IF(C14>76,VLOOKUP(F14,'c1'!B:E,4,FALSE),VLOOKUP(F14,'c1'!B:E,3,FALSE)))","v":0},0,{"$nulls":7},{"$f":"IFERROR(VLOOKUP(L14,List!I:J,2,FALSE),0)","v":0},0,{"$f":"IF(P14=3,(Q14+2*(G14+H14+I14))/SQRT(1-4*M14*M14/((Корпус!$C$19-2*Корпус!$C$20)*(Корпус!$C$19-2*Корпус!$C$20))),MAX(Штуцери!Q14,0.5*Штуцери!N14)+2*(Штуцери!G14+Штуцери!H14+Штуцери!I14))","v":0},{"$f":"IF(J14=\"\",0,IF(J14=List!$G$2,Корпус!$C$15-2*Корпус!$C$16,Корпус!$C$19-2*Корпус!$C$20))","v":0},{"$f":"IF(J14=Розрахунок!$A$74,Розрахунок!$I$78,IF(J14=Розрахунок!$A$80,Розрахунок!$I$84,0))","v":0},{"$f":"IF(J14=Розрахунок!$A$74,Корпус!$C$16,IF(J14=Розрахунок!$A$80,Корпус!$C$20,0))","v":0},{"$f":"Розрахунок!I146","v":""},1,{"$f":"IFERROR(VLOOKUP(CONCATENATE(E14,10*ROUND(Корпус!$C$9/10,0)),σ!C:D,2,FALSE),0)","v":0}]
[13,{"$nulls":5},{"$f":"IF(C15<32,0,IF(C15>76,VLOOKUP(F15,'c1'!B:E,4,FALSE),VLOOKUP(F15,'c1'!B:E,3,FALSE)))","v":0},0,{"$nulls":7},{"$f":"IFERROR(VLOOKUP(L15,List!I:J,2,FALSE),0)","v":0},0,{"$f":"IF(P15=3,(Q15+2*(G15+H15+I15))/SQRT(1-4*M15*M15/((Корпус!$C$19-2*Корпус!$C$20)*(Корпус!$C$19-2*Корпус!$C$20))),MAX(Штуцери!Q15,0.5*Штуцери!N15)+2*(Штуцери!G15+Штуцери!H15+Штуцери!I15))","v":0},{"$f":"IF(J15=\"\",0,IF(J15=List!$G$2,Корпус!$C$15-2*Корпус!$C$16,Корпус!$C$19-2*Корпус!$C$20))","v":0},{"$f":"IF(J15=Розрахунок!$A$74,Розрахунок!$I$78,IF(J15=Розрахунок!$A$80,Розрахунок!$I$84,0))","v":0},{"$f":"IF(J15=Розрахунок!$A$74,Корпус!$C$16,IF(J15=Розрахунок!$A$80,Корпус!$C$20,0))","v":0},{"$f":"Розрахунок!I147","v":""},1,{"$f":"IFERROR(VLOOKUP(CONCATENATE(E15,10*ROUND(Корпус!$C$9/10,0)),σ!C:D,2,FALSE),0)","v":0}]
[14,{"$nulls":5},{"$f":"IF(C16<32,0,IF(C16>76,VLOOKUP(F16,'c1'!B:E,4,FALSE),VLOOKUP(F16,'c1'!B:E,3,FALSE)))","v":0},0,{"$nulls":7},{"$f":"IFERROR(VLOOKUP(L16,List!I:J,2,FALSE),0)","v":0},0,{"$f":"IF(P16=3,(Q16+2*(G16+H16+I16))/SQRT(1-4*M16*M16/((Корпус!$C$19-2*Корпус!$C$20)*(Корпус!$C$19-2*Корпус!$C$20))),MAX(Штуцери!Q16,0.5*Штуцери!N16)+2*(Штуцери!G16+Штуцери!H16+Штуцери!I16))","v":0},{"$f":"IF(J16=\"\",0,IF(J16=List!$G$2,Корпус!$C$15-2*Корпус!$C$16,Корпус!$C$19-2*Корпус!$C$20))","v":0},{"$f":"IF(J16=Розрахунок!$A$74,Розрахунок!$I$78,IF(J16=Розрахунок!$A$80,Розрахунок!$I$84,0))","v":0},{"$f":"IF(J16=Розрахунок!$A$74,Корпус!$C$16,IF(J16=Розрахунок!$A$80,Корпус!$C$20,0))","v":0},{"$f":"Розрахунок!I148","v":""},1,{"$f":"IFERROR(VLOOKUP(CONCATENATE(E16,10*ROUND(Корпус!$C$9/10,0)),σ!C:D,2,FALSE),0)","v":0}]
[15,{"$nulls":5},{"$f":"IF(C17<32,0,IF(C17>76,VLOOKUP(F17,'c1'!B:E,4,FALSE),VLOOKUP(F17,'c1'!B:E,3,FALSE)))","v":0},0,{"$nulls":7},{"$f":"IFERROR(VLOOKUP(L17,List!I:J,2,FALSE),0)","v":0},0,{"$f":"IF(P17=3,(Q17+2*(G17+H17+I17))/SQRT(1-4*M17*M17/((Корпус!$C$19-2*Корпус!$C$20)*(Корпус!$C$19-2*Корпус!$C$20))),MAX(Штуцери!Q17,0.5*Штуцери!N17)+2*(Штуцери!G17+Штуцери!H17+Штуцери!I17))","v":0},{"$f":"IF(J17=\"\",0,IF(J17=List!$G$2,Корпус!$C$15-2*Корпус!$C$16,Корпус!$C$19-2*Корпус!$C$20))","v":0},{"$f":"IF(J17=Розрахунок!$A$74,Розрахунок!$I$78,IF(J17=Розрахунок!$A$80,Розрахунок!$I$84,0))","v":0},{"$f":"IF(J17=Розрахунок!$A$74,Корпус!$C$16,IF(J17=Розрахунок!$A$80,Корпус!$C$20,0))","v":0},{"$f":"Розрахунок!I149","v":""},1,{"$f":"IFERROR(VLOOKUP(CONCATENATE(E17,10*ROUND(Корпус!$C$9/10,0)),σ!C:D,2,FALSE),0)","v":0}]
[16,{"$nulls":5},{"$f":"IF(C18<32,0,IF(C18>76,VLOOKUP(F18,'c1'!B:E,4,FALSE),VLOOKUP(F18,'c1'!B:E,3,FALSE)))","v":0},0,{"$nulls":7},{"$f":"IFERROR(VLOOKUP(L18,List!I:J,2,FALSE),0)","v":0},0,{"$f":"IF(P18=3,(Q18+2*(G18+H18+I18))/SQRT(1-4*M18*M18/((Корпус!$C$19-2*Корпус!$C$20)*(Корпус!$C$19-2*Корпус!$C$20))),MAX(Штуцери!Q18,0.5*Штуцери!N18)+2*(Штуцери!G18+Штуцери!H18+Штуцери!I18))","v":0},{"$f":"IF(J18=\"\",0,IF(J18=List!$G$2,Корпус!$C$15-2*Корпус!$C$16,Корпус!$C$19-2*Корпус!$C$20))","v":0},{"$f":"IF(J18=Розрахунок!$A$74,Розрахунок!$I$78,IF(J18=Розрахунок!$A$80,Розрахунок!$I$84,0))","v":0},{"$f":"IF(J18=Розрахунок!$A$74,Корпус!$C$16,IF(J18=Розрахунок!$A$80,Корпус!$C$20,0))","v":0},{"$f":"Розрахунок!I150","v":""},1,{"$f":"IFERROR(VLOOKUP(CONCATENATE(E18,10*ROUND(Корпус!$C$9/10,0)),σ!C:D,2,FALSE),0)","v":0}]
[17,{"$nulls":5},{"$f":"IF(C19<32,0,IF(C19>76,VLOOKUP(F19,'c1'!B:E,4,FALSE),VLOOKUP(F19,'c1'!B:E,3,FALSE)))","v":0},0,{"$nulls":7},{"$f":"IFERROR(VLOOKUP(L19,List!I:J,2,FALSE),0)","v":0},0,{"$f":"IF(P19=3,(Q19+2*(G19+H19+I19))/SQRT(1-4*M19*M19/((Корпус!$C$19-2*Корпус!$C$20)*(Корпус!$C$19-2*Корпус!$C$20))),MAX(Штуцери!Q19,0.5*Штуцери!N19)+2*(Штуцери!G19+Штуцери!H19+Штуцери!I19))","v":0},{"$f":"IF(J19=\"\",0,IF(J19=List!$G$2,Корпус!$C$15-2*Корпус!$C$16,Корпус!$C$19-2*Корпус!$C$20))","v":0},{"$f":"IF(J19=Розрахунок!$A$74,Розрахунок!$I$78,IF(J19=Розрахунок!$A$80,Розрахунок!$I$84,0))","v":0},{"$f":"IF(J19=Розрахунок!$A$74,Корпус!$C$16,IF(J19=Розрахунок!$A$80,Корпус!$C$20,0))","v":0},{"$f":"Розрахунок!I151","v":""},1,{"$f":"IFERROR(VLOOKUP(CONCATENATE(E19,10*ROUND(Корпус!$C$9/10,0)),σ!C:D,2,FALSE),0)","v":0}]
[18,{"$nulls":5},{"$f":"IF(C20<32,0,IF(C20>76,VLOOKUP(F20,'c1'!B:E,4,FALSE),VLOOKUP(F20,'c1'!B:E,3,FALSE)))","v":0},0,{"$nulls":7},{"$f":"IFERROR(VLOOKUP(L20,List!I:J,2,FALSE),0)","v":0},0,{"$f":"IF(P20=3,(Q20+2*(G20+H20+I20))/SQRT(1-4*M20*M20/((Корпус!$C$19-2*Корпус!$C$20)*(Корпус!$C$19-2*Корпус!$C$20))),MAX(Штуцери!Q20,0.5*Штуцери!N20)+2*(Штуцери!G20+Штуцери!H20+Штуцери!I20))","v":0},{"$f":"IF(J20=\"\",0,IF(J20=List!$G$2,Корпус!$C$15-2*Корпус!$C$16,Корпус!$C$19-2*Корпус!$C$20))","v":0},{"$f":"IF(J20=Розрахунок!$A$74,Розрахунок!$I$78,IF(J20=Розрахунок!$A$80,Розрахунок!$I$84,0))","v":0},{"$f":"IF(J20=Розрахунок!$A$74,Корпус!$C$16,IF(J20=Розрахунок!$A$80,Корпус!$C$20,0))","v":0},{"$f":"Розрахунок!I152","v":""},1,{"$f":"IFERROR(VLOOKUP(CONCATENATE(E20,10*ROUND(Корпус!$C$9/10,0)),σ!C:D,2,FALSE),0)","v":0}]
{"$rows_left_out":12}
{"sheet":"Розрахунок","index":7,"n_rows":180,"n_cols":10,"rows_kept":180,"merged":[[15,1,20,8],[22,1,22,8],[57,2,57,6],[65,5,65,8],[86,1,86,8],[90,0,91,9],[99,0,100,4],[99,6,100,6],[99,7,100,9],[110,0,111,9],[119,0,120,4],[119,6,120,6],[119,7,120,9],[155,1,155,8]]}
{"$rows_empty":15}
[null,{"$f":"Корпус!C3","v":0}]
[]
[]
[]
[]
[]
[]
[null,"Розрахунок на міцність"]
{"$rows_empty":27}
[{"$nulls":4},{"$f":"Корпус!C5","v":0}]
[{"$nulls":4},{"$f":"Корпус!C6","v":0}]
[]
[]
[]
[]
[]
[null,null,"1. Вихідні дані"]
[]
[{"$f":"Корпус!B15","v":"Зовнішній діаметр обичайки (Dз), мм"},{"$nulls":7},{"$f":"Корпус!C15","v":0}]
{"$rows_left_out":120}